{"text_format":"1","workbook":"xlsx","n_sheets":9,"sheets":["Instructions","JV Template","Back up","Back up ","FundFY23","ORGFY23","AcctFY23","FUND","ORGN"],"not_rendered":{"charts":0,"images":2,"macros":0,"external_links":0,"defined_names":2,"comments":0,"pivot_tables":0},"unopened":[],"bounds":{"document_bytes":16777216,"sheet_cells":100000,"rows_first":2000,"rows_last":500,"rows_between":2000,"halvings":0,"cell_chars":16384,"cell_head_chars":4096},"cells_cut":0,"cells_raw":0,"read":"whole","date_system":"1900"}

{"sheet":"Instructions","index":0,"n_rows":37,"n_cols":2,"rows_kept":37,"cut":false,"hidden":false,"merged":[]}
[null,"Journal Entry Instructions"]
[]
[null,"Journal can be used for such things as: "]
[null,"      • A correction to previously recorded actual transactions    "]
[null,"      • Moving actual expenditure or actual revenues between FOAPAL's            "]
[null,"      • Recording internal sales "]
[]
[null,"–Transaction date will determine the accounting period that the transaction is recorded to.  It is only possible to record transactions to an open accounting period.  (JV’s should be sent to finance prior to the 5th working day to of the following month in order to be posted back to a prior period.)"]
[null,"–Descriptions are important to identify the nature of the transactions and to provide reference to document numbers that are being corrected or adjusted.  "]
[null,"–An explanation is required to ensure that any question arising regarding the JV can be answered by reviewing the transaction description and additional notes.  Proper documentation will ensure that there is no need for individual recollection."]
[null,"–Each JV needs to include the fund org and account."]
[]
[null,"Finance will complete the following fields for you:"]
[null,"**JV NUMBER:"]
[null,"**REFERENCE JV:"]
[null,"**JOURNAL TYPE:"]
[null,"**REV JV NUMBER:"]
[]
[null,"Please complete the following"]
[]
[null,"Correction:  Please list the document number of the entry you are correcting if applicable"]
[null,"**DESCRIPTION:  Please include a detailed description of the purposes of the journal and the related documents and parties impacted"]
[null,"**POSTING DATE:"]
[null,"FISCAL PERIOD:"]
[null,"FISCAL YEAR:"]
[null,"REVERSING DATE:"]
[]
[null,"Supporting documentation must be included with the JV.  The documentation must provide enough details to satisfy auditors"]
[]
[null,"What Constitutes Proper Backup?                                                                                                                                                  "]
{"$rows_left_out":8}
{"sheet":"JV Template","index":1,"n_rows":85,"n_cols":14,"rows_kept":85,"cut":false,"hidden":false,"merged":[[1,0,1,11],[2,0,2,11],[10,3,10,6],[12,3,12,6],[8,3,8,6],[6,3,6,6],[6,1,6,2],[8,1,8,2],[10,1,10,2],[12,1,12,2],[7,11,8,11],[63,3,63,6],[61,3,61,6],[59,3,59,6],[14,3,14,5],[14,1,14,2],[15,1,15,2],[15,3,15,11],[16,3,16,11],[17,3,17,11],[19,11,19,12],[20,11,20,12],[21,11,21,12],[22,11,22,12],[23,11,23,12],[24,11,24,12],[25,11,25,12],[26,11,26,12],[27,11,27,12],[28,11,28,12],[29,11,29,12],[30,11,30,12],[31,11,31,12],[32,11,32,12],[33,11,33,12],[34,11,34,12],[35,11,35,12],[36,11,36,12],[37,11,37,12],[38,11,38,12],[39,11,39,12],[40,11,40,12],[41,11,41,12],[42,11,42,12],[43,11,43,12],[44,11,44,12],[45,11,45,12],[46,11,46,12],[47,11,47,12],[48,11,48,12],[54,11,54,12],[55,11,55,12],[56,11,56,12],[49,11,49,12],[50,11,50,12],[51,11,51,12],[52,11,52,12],[53,11,53,12]]}
[]
["Finance"]
["JOURNAL VOUCHER",null,null,null,null,null,null,null,null,null,null,null,null,"INTEGRATED SERVICES"]
[]
[]
[null,null,null,null,null,null,null,null,null,null,null,null,null,"TREASURY"]
[null,"**JV NUMBER:",null,null,null,null,null,null,null,null,"**POSTING DATE:"]
[null,null,null,null,null,null,null,null,null,null,null,"(MM/DD/YYYY)"]
[null,"**REFERENCE JV:"]
[]
[null,"**JOURNAL TYPE:",null,"FT01 - Inter-Fund Journal Voucher",null,null,null,null,null,null,"FISCAL PERIOD:"]
[]
[null,"**REV JV NUMBER:",null,null,null,null,null,null,null,null,"FISCAL YEAR:","2023-24"]
[]
[null,"Correction: ",null,null,null,null,null,null,null,null,"REVERSING DATE:"]
[null,"**DESCRIPTION:"]
[]
[]
[]
["JE#","Ref","Activity Code","FUND","Fund Prog Code","ORG","ACCOUNT","PROGRAM","ACCOUNT DESCRIPTION","DEBIT","CREDIT","JOURNAL DETAILS"]
[null,null,null,null,{"$f":"_xlfn.IFNA(IFERROR(VLOOKUP($D21,FundFY23!$A:$C,3,FALSE),VLOOKUP($D21,FundFY23!$A:$C,3,FALSE)),\"\")","v":""},null,null,{"$f":"_xlfn.IFNA(IF(E21=\"ORG\",VLOOKUP(F21,ORGFY23!$A:$C,3,FALSE), E21),\"\")","v":""},{"$f":"IF(G21<=0,\" \",VLOOKUP(G21,AcctFY23!$A:$B,2,FALSE))","v":" "}]
[null,null,null,null,{"$f":"_xlfn.IFNA(IFERROR(VLOOKUP($D22,FundFY23!$A:$C,3,FALSE),VLOOKUP($D22,FundFY23!$A:$C,3,FALSE)),\"\")","v":""},null,null,{"$f":"_xlfn.IFNA(IF(E22=\"ORG\",VLOOKUP(F22,ORGFY23!$A:$C,3,FALSE), E22),\"\")","v":""},{"$f":"IF(G22<=0,\" \",VLOOKUP(G22,AcctFY23!$A:$B,2,FALSE))","v":" "}]
[null,null,null,null,{"$f":"_xlfn.IFNA(IFERROR(VLOOKUP($D23,FundFY23!$A:$C,3,FALSE),VLOOKUP($D23,FundFY23!$A:$C,3,FALSE)),\"\")","v":""},null,null,{"$f":"_xlfn.IFNA(IF(E23=\"ORG\",VLOOKUP(F23,ORGFY23!$A:$C,3,FALSE), E23),\"\")","v":""},{"$f":"IF(G23<=0,\" \",VLOOKUP(G23,AcctFY23!$A:$B,2,FALSE))","v":" "}]
[null,null,null,null,{"$f":"_xlfn.IFNA(IFERROR(VLOOKUP($D24,FundFY23!$A:$C,3,FALSE),VLOOKUP($D24,FundFY23!$A:$C,3,FALSE)),\"\")","v":""},null,null,{"$f":"_xlfn.IFNA(IF(E24=\"ORG\",VLOOKUP(F24,ORGFY23!$A:$C,3,FALSE), E24),\"\")","v":""},{"$f":"IF(G24<=0,\" \",VLOOKUP(G24,AcctFY23!$A:$B,2,FALSE))","v":" "}]
[null,null,null,null,{"$f":"_xlfn.IFNA(IFERROR(VLOOKUP($D25,FundFY23!$A:$C,3,FALSE),VLOOKUP($D25,FundFY23!$A:$C,3,FALSE)),\"\")","v":""},null,null,{"$f":"_xlfn.IFNA(IF(E25=\"ORG\",VLOOKUP(F25,ORGFY23!$A:$C,3,FALSE), E25),\"\")","v":""},{"$f":"IF(G25<=0,\" \",VLOOKUP(G25,AcctFY23!$A:$B,2,FALSE))","v":" "}]
[null,null,null,null,{"$f":"_xlfn.IFNA(IFERROR(VLOOKUP($D26,FundFY23!$A:$C,3,FALSE),VLOOKUP($D26,FundFY23!$A:$C,3,FALSE)),\"\")","v":""},null,null,{"$f":"_xlfn.IFNA(IF(E26=\"ORG\",VLOOKUP(F26,ORGFY23!$A:$C,3,FALSE), E26),\"\")","v":""},{"$f":"IF(G26<=0,\" \",VLOOKUP(G26,AcctFY23!$A:$B,2,FALSE))","v":" "}]
[null,null,null,null,{"$f":"_xlfn.IFNA(IFERROR(VLOOKUP($D27,FundFY23!$A:$C,3,FALSE),VLOOKUP($D27,FundFY23!$A:$C,3,FALSE)),\"\")","v":""},null,null,{"$f":"_xlfn.IFNA(IF(E27=\"ORG\",VLOOKUP(F27,ORGFY23!$A:$C,3,FALSE), E27),\"\")","v":""},{"$f":"IF(G27<=0,\" \",VLOOKUP(G27,AcctFY23!$A:$B,2,FALSE))","v":" "}]
[null,null,null,null,{"$f":"_xlfn.IFNA(IFERROR(VLOOKUP($D28,FundFY23!$A:$C,3,FALSE),VLOOKUP($D28,FundFY23!$A:$C,3,FALSE)),\"\")","v":""},null,null,{"$f":"_xlfn.IFNA(IF(E28=\"ORG\",VLOOKUP(F28,ORGFY23!$A:$C,3,FALSE), E28),\"\")","v":""},{"$f":"IF(G28<=0,\" \",VLOOKUP(G28,AcctFY23!$A:$B,2,FALSE))","v":" "}]
[null,null,null,null,{"$f":"_xlfn.IFNA(IFERROR(VLOOKUP($D29,FundFY23!$A:$C,3,FALSE),VLOOKUP($D29,FundFY23!$A:$C,3,FALSE)),\"\")","v":""},null,null,{"$f":"_xlfn.IFNA(IF(E29=\"ORG\",VLOOKUP(F29,ORGFY23!$A:$C,3,FALSE), E29),\"\")","v":""},{"$f":"IF(G29<=0,\" \",VLOOKUP(G29,AcctFY23!$A:$B,2,FALSE))","v":" "}]
[null,null,null,null,{"$f":"_xlfn.IFNA(IFERROR(VLOOKUP($D30,FundFY23!$A:$C,3,FALSE),VLOOKUP($D30,FundFY23!$A:$C,3,FALSE)),\"\")","v":""},null,null,{"$f":"_xlfn.IFNA(IF(E30=\"ORG\",VLOOKUP(F30,ORGFY23!$A:$C,3,FALSE), E30),\"\")","v":""},{"$f":"IF(G30<=0,\" \",VLOOKUP(G30,AcctFY23!$A:$B,2,FALSE))","v":" "}]
{"$rows_left_out":56}
{"sheet":"Back up","index":2,"n_rows":0,"n_cols":0,"rows_kept":0,"cut":false,"hidden":false,"merged":[]}

{"sheet":"Back up ","index":3,"n_rows":0,"n_cols":0,"rows_kept":0,"cut":false,"hidden":false,"merged":[]}

{"sheet":"FundFY23","index":4,"n_rows":3628,"n_cols":6,"rows_kept":3628,"cut":false,"hidden":true,"merged":[[0,0,1,0],[0,1,1,1],[0,2,1,2]]}
["FUND LVL4","DESCRIPTION","DEFAULT PROG",null,"As at:","2023-08-02"]
[]
[10048,"NSERC COVID Supplement F#210314",20]
[21019,"NSERC Covid Supplement F#210389",20]
[100000,"Regular Operating Fund","ORG"]
[100005,"Instructional Grant Fund","ORG"]
[100015,"Operating Transfers to IFR",10]
[100020,"Operating Allocations",10]
[100025,"Regent Corporation","ORG"]
[110000,"Cost Recovery","ORG"]
[120000,"Purchased Services","ORG"]
[125000,"Purchased Services - UOIT Specific","ORG"]
[130000,"Management Development Centre -FBIT",19]
[130002,"Continuous Learning",19]
[130004,"Experiential Learning",19]
[130010,"Stores",10]
[130011,"Materials Characterization Centre",10]
[130012,"Biomolecular Characterization Facil",10]
[130020,"Cent for Prof Dev in Education",19]
[130021,"Crime Scene Camp (Forensics Camp)",19]
[130022,"Education Camps",19]
[130023,"STEAM 3D Camp",19]
[130024,"HEIT Conference",10]
[130030,"SEM",11]
[130031,"Brilliant Sponsorship Funds",19]
[130032,"Brilliant Start-Up Visa Funds",19]
[130040,"UOIT Retail Store",18]
[130041,"Shop SIRC",18]
[130050,"Social Research Centre",10]
[130051,"Centre on Hate, Bias and Extremism",10]
{"$rows_left_out":3599}
{"sheet":"ORGFY23","index":5,"n_rows":205,"n_cols":6,"rows_kept":205,"cut":false,"hidden":true,"merged":[]}
["Orgn","DESCRIPTION","Default Prog.",null,"As at: ","2023-08-02"]
[1020,"RSPC",15]
[1021,"Eliminating Entry - OTU",15]
[1022,"Eliminating Entry - Regent",15]
[1100,"Board of Governors",15]
[1101,"Presidents Office",15]
[1102,"Secretariate",15]
[1200,"Finance & Admin - VP",15]
[1201,"Re-Engineering",15]
[1202,"Central Administration",15]
[1203,"Employee Benefit Cost Recov FTE45D",15]
[1204,"Employee Benefit Recovery PTZDU",15]
[1205,"Employee Costs Non-Recovery",15]
[1206,"Cultureworksn - CLosed to BS",15]
[1207,"Risk Management",15]
[1208,"Campus Safety Project",22]
[1209,"Cost Recovery - Anomalies",15]
[1210,"CAF20504 - Feasibility Study",15]
[1211,"Campus Safety",22]
[1215,"Ontario Tech Talent",15]
[1220,"Finance & Admin-Execu Dir- Closed",15]
[1221,"Financial Operations",15]
[1222,"Business Operations",15]
[1223,"Financial Planning & Reporting",15]
[1224,"Payroll",15]
[1225,"Finance Systems",15]
[1240,"OCIS",22]
[1241,"Facilities Management Admin Service",22]
[1242,"Facilities Management Cleaning",22]
[1243,"Facilities Management Utilities",22]
{"$rows_left_out":176}
{"sheet":"AcctFY23","index":6,"n_rows":864,"n_cols":5,"rows_kept":864,"cut":false,"hidden":true,"merged":[[0,0,1,0],[0,1,1,1]]}
["Account Lvl4","Description",null,"As at:","2023-08-02"]
[]
[11000,"BMO-Current Cash Account"]
[11001,"BMO-Cash Reserved for Debt Repmt"]
[11002,"BMO-Advancement"]
[11003,"BMO-Research Funds"]
[11004,"BMO-US Cash for UOIT"]
[11005,"BMO-ACE"]
[11006,"U.S. Operating Account - UOIT"]
[11007,"Royal-Current Account"]
[11008,"Petty Cash"]
[11009,"IBM Credit Facility"]
[11010,"U.S. Exchange"]
[11050,"U.S. Exchange Clearing"]
[11400,"BMO - Regent Theatre"]
[11500,"BMO - CCC Cash"]
[11600,"BMO - OTT Cash"]
[11700,"TD - CIC/CTC (Data Load Only)"]
[11800,"Deposit Clearing - Cash & Cheques"]
[11801,"Deposit Clearing - Credit/Debit"]
[11802,"Deposit Clearing - Wires"]
[11803,"Deposit Clearing - EDI"]
[11804,"Deposit Clearing - OSAP"]
[11805,"Deposit Clearing - Research Cheques"]
[11806,"Deposit Clearing - US Cash & Cheque"]
[11807,"Deposit Clearing - Advancement"]
[11808,"Deposit Clearing - ACE"]
[11809,"Deposit Clearing - OTT"]
[11900,"Claim on Cash (Inter-chart)"]
[11901,"Claim on Cash (Inter-fund)"]
{"$rows_left_out":835}
{"sheet":"FUND","index":7,"n_rows":1904,"n_cols":19,"rows_kept":1904,"cut":false,"hidden":true,"merged":[[0,18,1,18],[0,7,1,7],[0,10,1,10],[0,11,1,11],[0,12,1,12],[0,15,1,15],[0,17,1,17],[0,5,1,5],[0,0,1,0],[0,1,1,1],[0,2,1,2],[0,3,1,3],[0,4,1,4]]}
["TYPE LVL1","TYPE LVL2","FUND LVL1","FUND LVL2","FUND LVL3","FUND LVL4","FUND","DESCRIPTION","DATA","CNTL","CMB","STATUS","EFF DATE","TERM","NEXT CHANGE","MANAGER ID","FUND","DEFAULT ORGN","DEFAULT PROG"]
[null,null,null,null,null,null,"LVL5",null,"ENTRY","FUND",null,null,null,"DATE","DATE",null,"MANAGER"]
[null,"1A",100,null,null,null,null,"Regular Operating Fund","N",null,null,"A","2009-04-01",null,"2099-12-31"]
[null,null,null,1000,null,null,null,"Regular Operating Fund","N",null,null,"A","2009-04-01",null,"2099-12-31"]
[null,null,null,null,10000,null,null,"Regular Operating Fund","N",null,null,"A","2009-04-01",null,"2099-12-31"]
[null,null,null,null,null,100000,null,"Regular Operating Fund","Y",null,null,"A","2009-04-01",null,"2099-12-31",null,null,null,"ORG"]
[null,null,null,null,null,100015,null,"Operating Transfers to IFR","Y",null,null,"A","2014-04-01",null,"2099-12-31",100477674,"Elliott, Craig",null,10]
[null,null,110,null,null,null,null,"Cost Recovery","N",null,null,"A","2009-04-01",null,"2099-12-31"]
[null,null,null,1100,null,null,null,"Cost Recovery","N",null,null,"A","2009-04-01",null,"2099-12-31"]
[null,null,null,null,11000,null,null,"Cost Recovery","N",null,null,"A","2009-04-01",null,"2099-12-31"]
[null,null,null,null,null,110000,null,"Cost Recovery","Y",null,null,"A","2009-04-01",null,"2099-12-31",null,null,null,"ORG"]
[null,null,120,null,null,null,null,"Purchased Services","N",null,null,"A","2009-04-01",null,"2099-12-31"]
[null,null,null,1200,null,null,null,"Purchased Services","N",null,null,"A","2009-04-01",null,"2099-12-31"]
[null,null,null,null,12000,null,null,"Purchased Services","N",null,null,"A","2009-04-01",null,"2099-12-31"]
[null,null,null,null,null,120000,null,"Purchased Services","Y",null,null,"A","2009-04-01",null,"2099-12-31",null,null,null,"ORG"]
[null,null,null,null,null,125000,null,"Purchased Services - UOIT Specific","Y",null,null,"A","2011-04-01",null,"2099-12-31",null,null,null,"ORG"]
[null,null,130,null,null,null,null,"Revenue Units","N",null,null,"A","2009-04-01",null,"2099-12-31"]
[null,null,null,1300,null,null,null,"Revenue Units","N",null,null,"A","2009-04-01",null,"2099-12-31"]
[null,null,null,null,13000,null,null,"Revenue Units","N",null,null,"A","2009-04-01",null,"2099-12-31"]
[null,null,null,null,null,130000,null,"Management Development Centre -FBIT","Y",null,null,"A","2009-04-01",null,"2099-12-31",100377890,"Ritchie, Pamela",2200,10]
[null,null,null,null,null,130010,null,"Stores","Y",null,null,"A","2014-07-30",null,"2099-12-31",100550653,"Crawford, Gregory",2700,10]
[null,null,null,null,null,130020,null,"Additional Qualification -FEd","Y",null,null,"A","2009-04-01",null,"2099-12-31",null,null,2400,10]
[null,null,null,null,null,130021,null,"Crime Scene Camp (Forensics Camp)","Y",null,null,"A","2013-04-29",null,"2099-12-31",100246238,"Holdway, Douglas",2700,10]
[null,null,null,null,null,130022,null,"Education Camps","Y",null,null,"A","2014-05-01",null,"2099-12-31",null,null,2400,10]
[null,null,null,null,null,130030,null,"SEM","Y",null,null,"A","2014-04-04",null,"2099-12-31",100372919,"Owen, Michael",3200,11]
[null,null,null,null,null,130040,null,"UOIT Retail Store","Y",null,null,"A","2014-08-21",null,"2099-12-31",100513776,"McGovern, Susan",null,16]
[null,null,null,null,null,130050,null,"Social Research Centre","Y",null,null,"A","2014-10-24",null,"2099-12-31",100339617,"Ammar, Nawal",2300,10]
[null,null,140,null,null,null,null,"Unrestricted - Capital","N",null,null,"A","2009-04-01",null,"2099-12-31"]
[null,null,null,1400,null,null,null,"Capital Asset ","N",null,null,"A","2009-04-01",null,"2099-12-31"]
[null,null,null,null,14000,null,null,"Capital Asset","N",null,null,"A","2009-04-01",null,"2099-12-31"]
{"$rows_left_out":1875}
{"sheet":"ORGN","index":8,"n_rows":277,"n_cols":20,"rows_kept":277,"cut":false,"hidden":true,"merged":[[247,11,247,12],[248,11,248,12],[249,11,249,12],[250,11,250,12],[251,11,251,12],[252,11,252,12],[241,11,241,12],[242,11,242,12],[243,11,243,12],[244,11,244,12],[245,11,245,12],[246,11,246,12],[270,11,270,12],[259,11,259,12],[260,11,260,12],[261,11,261,12],[262,11,262,12],[263,11,263,12],[264,11,264,12],[253,11,253,12],[254,11,254,12],[255,11,255,12],[256,11,256,12],[257,11,257,12],[258,11,258,12],[265,11,265,12],[266,11,266,12],[267,11,267,12],[268,11,268,12],[269,11,269,12],[238,11,238,12],[239,11,239,12],[240,11,240,12],[229,11,229,12],[230,11,230,12],[231,11,231,12],[232,11,232,12],[233,11,233,12],[234,11,234,12],[235,11,235,12],[236,11,236,12],[237,11,237,12],[223,11,223,12],[224,11,224,12],[225,11,225,12],[226,11,226,12],[227,11,227,12],[228,11,228,12],[217,11,217,12],[218,11,218,12],[219,11,219,12],[220,11,220,12],[221,11,221,12],[222,11,222,12],[211,11,211,12],[212,11,212,12],[213,11,213,12],[214,11,214,12],[215,11,215,12],[216,11,216,12],[205,11,205,12],[206,11,206,12],[207,11,207,12],[208,11,208,12],[209,11,209,12],[210,11,210,12],[199,11,199,12],[200,11,200,12],[201,11,201,12],[202,11,202,12],[203,11,203,12],[204,11,204,12],[193,11,193,12],[194,11,194,12],[195,11,195,12],[196,11,196,12],[197,11,197,12],[198,11,198,12],[187,11,187,12],[188,11,188,12],[189,11,189,12],[190,11,190,12],[191,11,191,12],[192,11,192,12],[181,11,181,12],[182,11,182,12],[183,11,183,12],[184,11,184,12],[185,11,185,12],[186,11,186,12],[175,11,175,12],[176,11,176,12],[177,11,177,12],[178,11,178,12],[179,11,179,12],[180,11,180,12],[169,11,169,12],[170,11,170,12],[171,11,171,12],[172,11,172,12],[173,11,173,12],[174,11,174,12],[163,11,163,12],[164,11,164,12],[165,11,165,12],[166,11,166,12],[167,11,167,12],[168,11,168,12],[157,11,157,12],[158,11,158,12],[159,11,159,12],[160,11,160,12],[161,11,161,12],[162,11,162,12],[151,11,151,12],[152,11,152,12],[153,11,153,12],[154,11,154,12],[155,11,155,12],[156,11,156,12],[145,11,145,12],[146,11,146,12],[147,11,147,12],[148,11,148,12],[149,11,149,12],[150,11,150,12],[139,11,139,12],[140,11,140,12],[141,11,141,12],[142,11,142,12],[143,11,143,12],[144,11,144,12],[133,11,133,12],[134,11,134,12],[135,11,135,12],[136,11,136,12],[137,11,137,12],[138,11,138,12],[127,11,127,12],[128,11,128,12],[129,11,129,12],[130,11,130,12],[131,11,131,12],[132,11,132,12],[121,11,121,12],[122,11,122,12],[123,11,123,12],[124,11,124,12],[125,11,125,12],[126,11,126,12],[115,11,115,12],[116,11,116,12],[117,11,117,12],[118,11,118,12],[119,11,119,12],[120,11,120,12],[109,11,109,12],[110,11,110,12],[111,11,111,12],[112,11,112,12],[113,11,113,12],[114,11,114,12],[103,11,103,12],[104,11,104,12],[105,11,105,12],[106,11,106,12],[107,11,107,12],[108,11,108,12],[97,11,97,12],[98,11,98,12],[99,11,99,12],[100,11,100,12],[101,11,101,12],[102,11,102,12],[91,11,91,12],[92,11,92,12],[93,11,93,12],[94,11,94,12],[95,11,95,12],[96,11,96,12],[85,11,85,12],[86,11,86,12],[87,11,87,12],[88,11,88,12],[89,11,89,12],[90,11,90,12],[79,11,79,12],[80,11,80,12],[81,11,81,12],[82,11,82,12],[83,11,83,12],[84,11,84,12],[73,11,73,12],[74,11,74,12],[75,11,75,12],[76,11,76,12],[77,11,77,12],[78,11,78,12],[67,11,67,12],[68,11,68,12],[69,11,69,12],[70,11,70,12],[71,11,71,12],[72,11,72,12],[61,11,61,12],[62,11,62,12],[63,11,63,12],[64,11,64,12],[65,11,65,12],[66,11,66,12],[55,11,55,12],[56,11,56,12],[57,11,57,12],[58,11,58,12],[59,11,59,12],[60,11,60,12],[49,11,49,12],[50,11,50,12],[51,11,51,12],[52,11,52,12],[53,11,53,12],[54,11,54,12],[43,11,43,12],[44,11,44,12],[45,11,45,12],[46,11,46,12],[47,11,47,12],[48,11,48,12],[37,11,37,12],[38,11,38,12],[39,11,39,12],[40,11,40,12],[41,11,41,12],[42,11,42,12],[31,11,31,12],[32,11,32,12],[33,11,33,12],[34,11,34,12],[35,11,35,12],[36,11,36,12],[25,11,25,12],[26,11,26,12],[27,11,27,12],[28,11,28,12],[29,11,29,12],[30,11,30,12],[20,11,20,12],[21,11,21,12],[22,11,22,12],[23,11,23,12],[24,11,24,12],[13,11,13,12],[14,11,14,12],[15,11,15,12],[16,11,16,12],[17,11,17,12],[18,11,18,12],[7,11,7,12],[8,11,8,12],[9,11,9,12],[10,11,10,12],[11,11,11,12],[12,11,12,12],[0,0,0,19],[1,11,2,11],[19,11,19,12],[6,11,6,12],[5,11,5,12],[4,11,4,12],[3,11,3,12]]}
["Organization Hierarchy"]
["Orgn Lvl1","Orgn Lvl2","Orgn Lvl3","Orgn","Orgn","Orgn","Orgn","Orgn","DESCRIPTION","DATA","STATUS","Default Prog.",null,"CNTL","CMB","EFF.","TERM.","NEXT CHANGE","MANAGER ID","MANAGER"]
[null,null,null,"Lvl4","Lvl5","Lvl6","Lvl7","Lvl8",null,"ENTRY",null,null,null,"ORGN",null,"DATE","DATE","DATE",null,"NAME"]
[0,null,null,null,null,null,null,null,"ORG FOR BALANCE SHEET ACC PURCHASES","Y","A",null,null,null,"N","2010-04-01",null,"2099-12-31"]
["UOIT",null,null,null,null,null,null,null,"UOIT","N","A",null,null,null,null,"2009-04-01",null,"2099-12-31"]
[null,"1A",null,null,null,null,null,null,"Administrative Services","N","A",null,null,null,null,"2009-04-01",null,"2099-12-31"]
[null,null,11,null,null,null,null,null,"Office of the President","N","A",null,null,null,null,"2013-08-27",null,"2099-12-31",100469874,"McTiernan, Tim"]
[null,null,null,110,null,null,null,null,"Office of the President","N","A",null,null,null,null,"2013-08-27",null,"2099-12-31",100469874,"McTiernan, Tim"]
[null,null,null,null,1100,null,null,null,"Board of Governors","Y","A",15,null,null,null,"2013-07-26",null,"2099-12-31",100469874,"McTiernan, Tim"]
[null,null,null,null,1101,null,null,null,"Presidents Office","Y","A",15,null,null,null,"2013-07-25",null,"2099-12-31",100469874,"McTiernan, Tim"]
[null,null,null,null,1102,null,null,null,"Secretariate","Y","A",15,null,null,null,"2013-04-01",null,"2099-12-31"]
[null,null,12,null,null,null,null,null,"VP Finance","N","A",null,null,null,null,"2013-08-27",null,"2099-12-31",100477674,"Elliott, Craig"]
[null,null,null,120,null,null,null,null,"VP Finance","N","A",null,null,null,null,"2013-01-22",null,"2099-12-31",100477674,"Elliott, Craig"]
[null,null,null,null,1200,null,null,null,"Finance & Admin - VP","Y","A",15,null,null,null,"2013-04-26",null,"2099-12-31",100477674,"Elliott, Craig"]
[null,null,null,null,1201,null,null,null,"Re-Engineering","Y","A",15,null,null,null,"2013-01-22",null,"2099-12-31",100477674,"Elliott, Craig"]
[null,null,null,null,1202,null,null,null,"Central Administration","Y","A",15,null,null,null,"2013-07-25",null,"2099-12-31",100477674,"Elliott, Craig"]
[null,null,null,null,1203,null,null,null,"Employee Benefit Cost Recov FTE45D","Y","A",15,null,null,null,"2013-08-27",null,"2099-12-31",100477674,"Elliott, Craig"]
[null,null,null,null,1204,null,null,null,"Employee Benefit Recovery PTZDU","Y","A",15,null,null,null,"2013-08-27",null,"2099-12-31",100477674,"Elliott, Craig"]
[null,null,null,null,1205,null,null,null,"Employee Costs Non-Recovery","Y","A",15,null,null,null,"2013-08-27",null,"2099-12-31",100477674,"Elliott, Craig"]
[null,null,null,null,1206,null,null,null,"Cultureworksn - CLosed to BS","Y","I",15,null,null,null,"2012-03-13",null,"2099-12-31",100350386,"Milovick, Matt"]
[null,null,null,null,1207,null,null,null,"Risk Management","Y","A",15,null,null,null,"2013-01-22",null,"2099-12-31",100477674,"Elliott, Craig"]
[null,null,null,null,1208,null,null,{"$f":"IF(E22=\"ORG\",VLOOKUP(F22,ORGN!A:T,8), E22)","v":1208},"Campus Safety","Y","A",22,null,null,null,"2013-08-27",null,"2099-12-31",100477674,"Elliott, Craig"]
[null,null,null,null,1209,null,null,null,"Cost Recovery - Anomalies","Y","A",15,null,null,null,"2013-08-27",null,"2099-12-31",100477674,"Elliott, Craig"]
[null,null,null,null,1210,null,null,null,"CAF20504 - Feasibility Study","Y","A",15,null,null,null,"2013-08-27",null,"2099-12-31",100477674,"Elliott, Craig"]
[null,null,null,null,1211,null,null,null,"Women's Campus Safety","Y","A",15,null,null,null,"2014-04-29",null,"2099-12-31",100477674,"Elliott, Craig"]
[null,null,null,null,"AAA",null,null,null,"P&L ORGs to BS - CLOSED","Y","I",15,null,null,null,"2010-11-09",null,"2099-12-31",100350386,"Milovick, Matt"]
[null,null,null,122,null,null,null,null,"Executive Finance","N","A",null,null,null,null,"2013-08-27",null,"2099-12-31",100477674,"Elliott, Craig"]
[null,null,null,null,1220,null,null,null,"Finance & Admin-Execu Dir- Closed","Y","I",15,null,null,null,"2012-05-08",null,"2099-12-31",100329866,"Rigby, Judy"]
[null,null,null,null,1221,null,null,null,"Finance & Admin-Research","Y","A",15,null,null,null,"2013-07-25",null,"2099-12-31",100477674,"Elliott, Craig"]
[null,null,null,null,1222,null,null,null,"Business Operations","Y","A",15,null,null,null,"2013-07-25",null,"2099-12-31",100477674,"Elliott, Craig"]
{"$rows_left_out":247}